Target
Carbonic anhydrase
Ligand
BDBM26188
Substrate
Meas. Tech.
ChEMBL_757508 (CHEMBL1804480)
Ki
14800±n/a nM
Citation
 Oztürk Sarikaya, SBTopal, FSentürk, MGülçin, ISupuran, CT In vitro inhibition ofa-carbonic anhydrase isozymes by some phenolic compounds. Bioorg Med Chem Lett 21:4259-62 (2011)  
Target
Name:
Carbonic anhydrase
Synonyms:
Type:
PROTEIN
Mol. Mass.:
32973.15
Organism:
Dicentrarchus labrax
Description:
ChEMBL_757508
Residue:
309
  
Inhibitor
Name:
BDBM26188
Synonyms:
α-CA inhibitor, 12 1,2-dihydroxybenzene benzene-1,2-diol | phenol derivative, 2
Type:
Small organic molecule
Emp. Form.:
C6H6O2
Mol. Mass.:
110.1106
SMILES:
Oc1ccccc1O
: