Target
E3 ubiquitin-protein ligase XIAP
Ligand
BDBM44260
Substrate
Meas. Tech.
ChEMBL_757199 (CHEMBL1803423)
Ki
590±n/a nM
Citation
 González-López, MWelsh, KFinlay, DArdecky, RJGanji, SRSu, YYuan, HTeriete, PMace, PDRiedl, SJVuori, KReed, JCCosford, ND Design, synthesis and evaluation of monovalent Smac mimetics that bind to the BIR2 domain of the anti-apoptotic protein XIAP. Bioorg Med Chem Lett 21:4332-6 (2011)  
Target
Name:
E3 ubiquitin-protein ligase XIAP
Synonyms:
API3 E3 ubiquitin-protein ligase XIAP Inhibitor of apoptosis protein 3 X-linked inhibitor of apoptosis XIAP | XIAP_HUMAN
Type:
Protein
Mol. Mass.:
56685.27
Organism:
Homo sapiens (Human)
Description:
P98170
Residue:
497
  
Inhibitor
Name:
BDBM44260
Synonyms:
(2S)-1-[(2S)-3-methyl-2-[[(2S)-2-(methylamino)-1-oxopropyl]amino]-1-oxobutyl]-N-(phenylmethyl)-2-pyrrolidinecarboxamide;2,2,2-trifluoroacetic acid (2S)-N-benzyl-1-[(2S)-3-methyl-2-[[(2S)-2-(methylamino)propanoyl]amino]butanoyl]pyrrolidine-2-carboxamide;2,2,2-trifluoroacetic acid MLS-0390971.0001 | cid_25199557
Type:
Small organic molecule
Emp. Form.:
C21H32N4O3
Mol. Mass.:
388.5038
SMILES:
CN[C@@H](C)C(=O)N[C@@H](C(C)C)C(=O)N1CCC[C@H]1C(=O)NCc1ccccc1
: