Target
E3 ubiquitin-protein ligase XIAP
Ligand
BDBM44335
Substrate
Meas. Tech.
ChEMBL_757199 (CHEMBL1803423)
Ki
16210±n/a nM
Citation
 González-López, MWelsh, KFinlay, DArdecky, RJGanji, SRSu, YYuan, HTeriete, PMace, PDRiedl, SJVuori, KReed, JCCosford, ND Design, synthesis and evaluation of monovalent Smac mimetics that bind to the BIR2 domain of the anti-apoptotic protein XIAP. Bioorg Med Chem Lett 21:4332-6 (2011)  
Target
Name:
E3 ubiquitin-protein ligase XIAP
Synonyms:
API3 E3 ubiquitin-protein ligase XIAP Inhibitor of apoptosis protein 3 X-linked inhibitor of apoptosis XIAP | XIAP_HUMAN
Type:
Protein
Mol. Mass.:
56685.27
Organism:
Homo sapiens (Human)
Description:
P98170
Residue:
497
  
Inhibitor
Name:
BDBM44335
Synonyms:
(2S)-N-isoquinolin-5-yl-1-[(2S)-3-methyl-2-[[(2S)-2-(methylamino)propanoyl]amino]butanoyl]pyrrolidine-2-carboxamide;methanoic acid MLS-0391031.0001 formic acid;(2S)-N-(5-isoquinolinyl)-1-[(2S)-3-methyl-2-[[(2S)-2-(methylamino)-1-oxopropyl]amino]-1-oxobutyl]-2-pyrrolidinecarboxamide formic acid;(2S)-N-isoquinolin-5-yl-1-[(2S)-3-methyl-2-[[(2S)-2-(methylamino)propanoyl]amino]butanoyl]pyrrolidine-2-carboxamide
Type:
Small organic molecule
Emp. Form.:
C23H31N5O3
Mol. Mass.:
425.5239
SMILES:
CN[C@@H](C)C(=O)N[C@@H](C(C)C)C(=O)N1CCC[C@H]1C(=O)Nc1cccc2cnccc12
: