Target
MAP kinase-activated protein kinase 2
Ligand
BDBM50348483
Substrate
Meas. Tech.
ChEMBL_754901 (CHEMBL1805885)
IC50
37±n/a nM
Citation
 Revesz, LSchlapbach, AAichholz, RDawson, JFeifel, RHawtin, SLittlewood-Evans, AKoch, GKroemer, MMöbitz, HScheufler, CVelcicky, JHuppertz, C In vivo and in vitro SAR of tetracyclic MAPKAP-K2 (MK2) inhibitors. Part II. Bioorg Med Chem Lett 20:4719-23 (2010)  
Target
Name:
MAP kinase-activated protein kinase 2
Synonyms:
MAP kinase-activated protein kinase 2 (MAPKAPK2) MAP kinase-activated protein kinase 2 (p38/MK2) MAPK-activated protein kinase 2 MAPKAP kinase 2 MAPKAPK2 | MK2
Type:
Serine/threonine-protein kinase
Mol. Mass.:
45579.87
Organism:
Homo sapiens (Human)
Description:
P49137
Residue:
400
  
Inhibitor
Name:
BDBM50348483
Synonyms:
CHEMBL1801194
Type:
Small organic molecule
Emp. Form.:
C20H16FN3O
Mol. Mass.:
333.3589
SMILES:
Fc1ccccc1-c1cc2-c3[nH]c4CCNC(=O)c4c3CCc2cn1
: