Target
MAP kinase-activated protein kinase 2
Ligand
BDBM50348516
Substrate
Meas. Tech.
ChEMBL_754903 (CHEMBL1805887)
IC50
700±n/a nM
Citation
 Revesz, LSchlapbach, AAichholz, RDawson, JFeifel, RHawtin, SLittlewood-Evans, AKoch, GKroemer, MMöbitz, HScheufler, CVelcicky, JHuppertz, C In vivo and in vitro SAR of tetracyclic MAPKAP-K2 (MK2) inhibitors. Part II. Bioorg Med Chem Lett 20:4719-23 (2010)  
Target
Name:
MAP kinase-activated protein kinase 2
Synonyms:
MAP kinase-activated protein kinase 2 (MAPKAPK2) MAP kinase-activated protein kinase 2 (p38/MK2) MAPK-activated protein kinase 2 MAPKAP kinase 2 MAPKAPK2 | MK2
Type:
Serine/threonine-protein kinase
Mol. Mass.:
45579.87
Organism:
Homo sapiens (Human)
Description:
P49137
Residue:
400
  
Inhibitor
Name:
BDBM50348516
Synonyms:
CHEMBL1801288
Type:
Small organic molecule
Emp. Form.:
C24H24N4O2
Mol. Mass.:
400.473
SMILES:
COc1ccc(cc1)-c1cc2-c3[nH]c4c(c3CCc2cn1)C(=O)NCC41CN(C)C1
: