Target
MAP kinase-activated protein kinase 2
Ligand
BDBM50348498
Substrate
Meas. Tech.
ChEMBL_754903 (CHEMBL1805887)
IC50
1400±n/a nM
Citation
 Revesz, LSchlapbach, AAichholz, RDawson, JFeifel, RHawtin, SLittlewood-Evans, AKoch, GKroemer, MMöbitz, HScheufler, CVelcicky, JHuppertz, C In vivo and in vitro SAR of tetracyclic MAPKAP-K2 (MK2) inhibitors. Part II. Bioorg Med Chem Lett 20:4719-23 (2010)  
Target
Name:
MAP kinase-activated protein kinase 2
Synonyms:
MAP kinase-activated protein kinase 2 (MAPKAPK2) MAP kinase-activated protein kinase 2 (p38/MK2) MAPK-activated protein kinase 2 MAPKAP kinase 2 MAPKAPK2 | MK2
Type:
Serine/threonine-protein kinase
Mol. Mass.:
45579.87
Organism:
Homo sapiens (Human)
Description:
P49137
Residue:
400
  
Inhibitor
Name:
BDBM50348498
Synonyms:
CHEMBL1801283
Type:
Small organic molecule
Emp. Form.:
C21H17FN4O
Mol. Mass.:
360.3843
SMILES:
Fc1ccc(cn1)-c1cc2-c3[nH]c4c(c3CCc2cn1)C(=O)NCC41CC1
: