Target
Melanocortin receptor 4
Ligand
BDBM50348579
Substrate
Meas. Tech.
ChEMBL_755005 (CHEMBL1805907)
IC50
0.530000±n/a nM
Citation
 He, SYe, ZDobbelaar, PHSebhat, IKGuo, LLiu, JJian, TLai, YFranklin, CLBakshi, RKDellureficio, JPHong, QWeinberg, DHMacneil, TTang, RStrack, AMTamvakopoulos, CPeng, QMiller, RRStearns, RAChen, HYChen, ASFong, TMWyvratt, MJNargund, RP Spiroindane based amides as potent and selective MC4R agonists for the treatment of obesity. Bioorg Med Chem Lett 20:4399-405 (2010)  
Target
Name:
Melanocortin receptor 4
Synonyms:
MC4-R MC4R_HUMAN Melanocortin receptor 4 (MC-4) Melanocortin receptor 4 (MC4R)
Type:
Enzyme
Mol. Mass.:
36949.50
Organism:
Homo sapiens (Human)
Description:
P32245
Residue:
332
  
Inhibitor
Name:
BDBM50348579
Synonyms:
CHEMBL1801215
Type:
Small organic molecule
Emp. Form.:
C37H48ClF2N3O3
Mol. Mass.:
656.245
SMILES:
Cc1cc2[C@H](CC3(CCN(CC3)C(=O)[C@@H]3CN(C[C@H]3c3ccc(F)cc3F)C(C)(C)C)c2cc1Cl)C(C)(C)C(=O)N1CC[C@@H](O)C1
: