Target
Neuropeptide S receptor
Ligand
BDBM50348589
Substrate
Meas. Tech.
ChEMBL_755375 (CHEMBL1804531)
IC50
254±n/a nM
Citation
 Trotter, BWNanda, KKManley, PJUebele, VNCondra, CLGotter, ALMenzel, KHenault, MStocco, RRenger, JJHartman, GDBilodeau, MT Tricyclic imidazole antagonists of the Neuropeptide S Receptor. Bioorg Med Chem Lett 20:4704-8 (2010)  
Target
Name:
Neuropeptide S receptor
Synonyms:
GPR154 NPSR1 PGR14
Type:
PROTEIN
Mol. Mass.:
42692.30
Organism:
Homo sapiens (Human)
Description:
ChEMBL_1276607
Residue:
371
  
Inhibitor
Name:
BDBM50348589
Synonyms:
CHEMBL1801270
Type:
Small organic molecule
Emp. Form.:
C23H23BrN2
Mol. Mass.:
407.346
SMILES:
Brc1ccc(cc1)C1(CC2CCCCC2)c2ccccc2-c2nccn12
: