Target
Neutrophil collagenase
Ligand
BDBM50348650
Substrate
Meas. Tech.
ChEMBL_754462 (CHEMBL1806087)
IC50
0.600000±n/a nM
Citation
 Becker, DPBarta, TEBedell, LJBoehm, TLBond, BRCarroll, JCarron, CPDecrescenzo, GAEaston, AMFreskos, JNFunckes-Shippy, CLHeron, MHockerman, SHoward, CPKiefer, JRLi, MHMathis, KJMcDonald, JJMehta, PPMunie, GESunyer, TSwearingen, CAVillamil, CIWelsch, DWilliams, JMYu, YYao, J Orally active MMP-1 sparinga-tetrahydropyranyl anda-piperidinyl sulfone matrix metalloproteinase (MMP) inhibitors with efficacy in cancer, arthritis, and cardiovascular disease. J Med Chem 53:6653-80 (2010)  
Target
Name:
Neutrophil collagenase
Synonyms:
CLG1 MMP8 Matrix metalloproteinase-8 PMNL collagenase | PMNL-CL
Type:
Enzyme
Mol. Mass.:
53413.48
Organism:
Homo sapiens (Human)
Description:
P22894
Residue:
467
  
Inhibitor
Name:
BDBM50348650
Synonyms:
CHEMBL1801431
Type:
Small organic molecule
Emp. Form.:
C25H24F3N3O6S
Mol. Mass.:
551.535
SMILES:
ONC(=O)C1(CCN(Cc2ccccn2)CC1)S(=O)(=O)c1ccc(Oc2ccc(OC(F)(F)F)cc2)cc1
: