Target
Stromelysin-1
Ligand
BDBM11885
Substrate
Meas. Tech.
ChEMBL_754460 (CHEMBL1806085)
IC50
13±n/a nM
Citation
 Becker, DPBarta, TEBedell, LJBoehm, TLBond, BRCarroll, JCarron, CPDecrescenzo, GAEaston, AMFreskos, JNFunckes-Shippy, CLHeron, MHockerman, SHoward, CPKiefer, JRLi, MHMathis, KJMcDonald, JJMehta, PPMunie, GESunyer, TSwearingen, CAVillamil, CIWelsch, DWilliams, JMYu, YYao, J Orally active MMP-1 sparinga-tetrahydropyranyl anda-piperidinyl sulfone matrix metalloproteinase (MMP) inhibitors with efficacy in cancer, arthritis, and cardiovascular disease. J Med Chem 53:6653-80 (2010)  
Target
Name:
Stromelysin-1
Synonyms:
MMP-3 MMP3_HUMAN Matrix metalloproteinase 3 Matrix metalloproteinase-3 (MMP-3) SL-1 Stromelysin 1 | Transin-1
Type:
Enzyme
Mol. Mass.:
53973.13
Organism:
Homo sapiens (Human)
Description:
P08254
Residue:
477
  
Inhibitor
Name:
BDBM11885
Synonyms:
CHEMBL1082381 N-hydroxy-4-{[4-(phenylsulfanyl)benzene]sulfonyl}-1-(prop-2-yn-1-yl)piperidine-4-carboxamide hydrochloride alpha-sulfone 35f
Type:
Small organic molecule
Emp. Form.:
C21H22N2O4S2
Mol. Mass.:
430.54
SMILES:
ONC(=O)C1(CCN(CC#C)CC1)S(=O)(=O)c1ccc(Sc2ccccc2)cc1
: