Target
Interstitial collagenase
Ligand
BDBM11885
Substrate
Meas. Tech.
ChEMBL_754458 (CHEMBL1806083)
IC50
8660±n/a nM
Citation
 Becker, DPBarta, TEBedell, LJBoehm, TLBond, BRCarroll, JCarron, CPDecrescenzo, GAEaston, AMFreskos, JNFunckes-Shippy, CLHeron, MHockerman, SHoward, CPKiefer, JRLi, MHMathis, KJMcDonald, JJMehta, PPMunie, GESunyer, TSwearingen, CAVillamil, CIWelsch, DWilliams, JMYu, YYao, J Orally active MMP-1 sparinga-tetrahydropyranyl anda-piperidinyl sulfone matrix metalloproteinase (MMP) inhibitors with efficacy in cancer, arthritis, and cardiovascular disease. J Med Chem 53:6653-80 (2010)  
Target
Name:
Interstitial collagenase
Synonyms:
CLG MMP1 Matrix metalloproteinase-1 | Matrix metalloproteinase-1 (MMP-1)
Type:
Enzyme
Mol. Mass.:
54010.26
Organism:
Homo sapiens (Human)
Description:
P03956
Residue:
469
  
Inhibitor
Name:
BDBM11885
Synonyms:
CHEMBL1082381 N-hydroxy-4-{[4-(phenylsulfanyl)benzene]sulfonyl}-1-(prop-2-yn-1-yl)piperidine-4-carboxamide hydrochloride alpha-sulfone 35f
Type:
Small organic molecule
Emp. Form.:
C21H22N2O4S2
Mol. Mass.:
430.54
SMILES:
ONC(=O)C1(CCN(CC#C)CC1)S(=O)(=O)c1ccc(Sc2ccccc2)cc1
: