Target
Nitric oxide synthase, endothelial
Ligand
BDBM50348715
Substrate
Meas. Tech.
ChEMBL_754922 (CHEMBL1806044)
EC50
>100000±n/a nM
Citation
 Payne, JEBonnefous, CSymons, KTNguyen, PMSablad, MRozenkrants, NZhang, YWang, LYazdani, NShiau, AKNoble, SARix, PRao, TSHassig, CASmith, ND Discovery of dual inducible/neuronal nitric oxide synthase (iNOS/nNOS) inhibitor development candidate 4-((2-cyclobutyl-1H-imidazo[4,5-b]pyrazin-1-yl)methyl)-7,8-difluoroquinolin-2(1H)-one (KD7332) part 2: identification of a novel, potent, and selective series of benzimidazole-quinolinone iNOS/nNO J Med Chem 53:7739-55 (2010)  
Target
Name:
Nitric oxide synthase, endothelial
Synonyms:
Constitutive NOS Endothelial NOS NOS type III NOS3_HUMAN Nitric oxide synthase (inducible and endothelial) Nitric-oxide synthase (endothelial and brain) eNOS
Type:
Enzyme Catalytic Domain
Mol. Mass.:
133297.84
Organism:
Homo sapiens (Human)
Description:
P29474
Residue:
1203
  
Inhibitor
Name:
BDBM50348715
Synonyms:
CHEMBL1801479
Type:
Small organic molecule
Emp. Form.:
C22H14F2N4O
Mol. Mass.:
388.3696
SMILES:
Fc1ccc2c(Cn3c(nc4ccccc34)-c3cccnc3)cc(=O)[nH]c2c1F
: