Target
Cytochrome P450 2C19
Ligand
BDBM50348733
Substrate
Meas. Tech.
ChEMBL_755033 (CHEMBL1805935)
EC50
>60000±n/a nM
Citation
 Payne, JEBonnefous, CSymons, KTNguyen, PMSablad, MRozenkrants, NZhang, YWang, LYazdani, NShiau, AKNoble, SARix, PRao, TSHassig, CASmith, ND Discovery of dual inducible/neuronal nitric oxide synthase (iNOS/nNOS) inhibitor development candidate 4-((2-cyclobutyl-1H-imidazo[4,5-b]pyrazin-1-yl)methyl)-7,8-difluoroquinolin-2(1H)-one (KD7332) part 2: identification of a novel, potent, and selective series of benzimidazole-quinolinone iNOS/nNO J Med Chem 53:7739-55 (2010)  
Target
Name:
Cytochrome P450 2C19
Synonyms:
CP2CJ_HUMAN CYPIIC17 Cytochrome P450 2C19 (CYP2C19) Mephenytoin 4-hydroxylase P450-254C
Type:
Enzyme
Mol. Mass.:
55935.47
Organism:
Homo sapiens (Human)
Description:
P33261
Residue:
490
  
Inhibitor
Name:
BDBM50348733
Synonyms:
CHEMBL1801060
Type:
Small organic molecule
Emp. Form.:
C19H16FN5O
Mol. Mass.:
349.3616
SMILES:
Fc1cccc2c(Cn3c(nc4nccnc34)C3CCC3)cc(=O)[nH]c12
: