Target
Nitric oxide synthase, inducible
Ligand
BDBM50348709
Substrate
Meas. Tech.
ChEMBL_754928 (CHEMBL1806050)
EC50
3300±n/a nM
Citation
 Payne, JEBonnefous, CSymons, KTNguyen, PMSablad, MRozenkrants, NZhang, YWang, LYazdani, NShiau, AKNoble, SARix, PRao, TSHassig, CASmith, ND Discovery of dual inducible/neuronal nitric oxide synthase (iNOS/nNOS) inhibitor development candidate 4-((2-cyclobutyl-1H-imidazo[4,5-b]pyrazin-1-yl)methyl)-7,8-difluoroquinolin-2(1H)-one (KD7332) part 2: identification of a novel, potent, and selective series of benzimidazole-quinolinone iNOS/nNO J Med Chem 53:7739-55 (2010)  
Target
Name:
Nitric oxide synthase, inducible
Synonyms:
Inducible NO synthase Inducible nitric oxide synthase (iNOS) MAC-NOS NOS type II Nitric Oxide Synthase, inducible Nos2
Type:
Enzyme
Mol. Mass.:
130595.79
Organism:
Mus musculus (mouse)
Description:
Recombinant enzyme overexpressed in E. coli.
Residue:
1144
  
Inhibitor
Name:
BDBM50348709
Synonyms:
CHEMBL1801062
Type:
Small organic molecule
Emp. Form.:
C19H14F3N5O
Mol. Mass.:
385.3426
SMILES:
Fc1cccc2c(Cn3c(nc4nccnc34)C3CC(F)(F)C3)cc(=O)[nH]c12
: