Target
Peptide deformylase, mitochondrial
Ligand
BDBM50349077
Substrate
Meas. Tech.
ChEMBL_759151 (CHEMBL1811208)
IC50
45000±n/a nM
Citation
 Antczak, CShum, DBassit, BFrattini, MGLi, Yde Stanchina, EScheinberg, DADjaballah, H Identification of benzofuran-4,5-diones as novel and selective non-hydroxamic acid, non-peptidomimetic based inhibitors of human peptide deformylase. Bioorg Med Chem Lett 21:4528-32 (2011)  
Target
Name:
Peptide deformylase, mitochondrial
Synonyms:
DEFM_HUMAN PDF1A Peptide deformylase, mitochondrial | Polypeptide deformylase
Type:
PROTEIN
Mol. Mass.:
27023.25
Organism:
Homo sapiens (Human)
Description:
ChEMBL_154318
Residue:
243
  
Inhibitor
Name:
BDBM50349077
Synonyms:
CHEMBL1807949
Type:
Small organic molecule
Emp. Form.:
C15H6Cl2O4
Mol. Mass.:
321.112
SMILES:
ClC1=C(Cl)C(=O)C(=O)c2c(coc12)C(=O)c1ccccc1
: