Target
Chymase
Ligand
BDBM50349173
Substrate
Meas. Tech.
ChEMBL_759674 (CHEMBL1811418)
IC50
65±n/a nM
Citation
 Lo, HYNemoto, PAKim, JMHao, MHQian, KCFarrow, NAAlbaugh, DRFowler, DMSchneiderman, RDMichael August, EMartin, LHill-Drzewi, MPullen, SSTakahashi, HDe Lombaert, S Benzimidazolone as potent chymase inhibitor: modulation of reactive metabolite formation in the hydrophobic (P1) region. Bioorg Med Chem Lett 21:4533-9 (2011)  
Target
Name:
Chymase
Synonyms:
Alpha-chymase CMA1_HUMAN CYM Mast cell protease I
Type:
Enzyme
Mol. Mass.:
27340.12
Organism:
Homo sapiens (Human)
Description:
Residue:
247
  
Inhibitor
Name:
BDBM50349173
Synonyms:
CHEMBL1807638
Type:
Small organic molecule
Emp. Form.:
C23H25N3O3
Mol. Mass.:
391.4629
SMILES:
Cc1c(C)c2cc(C)cc(Cn3c4ccccc4n(CCC(O)=O)c3=O)c2n1C
: