Target
Transmembrane protease serine 11D
Ligand
BDBM50349338
Substrate
Meas. Tech.
ChEMBL_760105 (CHEMBL1810428)
Ki
149±n/a nM
Citation
 Sielaff, FBöttcher-Friebertshäuser, EMeyer, DSaupe, SMVolk, IMGarten, WSteinmetzer, T Development of substrate analogue inhibitors for the human airway trypsin-like protease HAT. Bioorg Med Chem Lett 21:4860-4 (2011)  
Target
Name:
Transmembrane protease serine 11D
Synonyms:
Airway trypsin-like protease TM11D_HUMAN Transmembrane protease serine 11D catalytic chain | Transmembrane protease serine 11D non-catalytic chain
Type:
PROTEIN
Mol. Mass.:
46272.53
Organism:
Homo sapiens (Human)
Description:
ChEMBL_840134
Residue:
418
  
Inhibitor
Name:
BDBM50349338
Synonyms:
CHEMBL1809244
Type:
Small organic molecule
Emp. Form.:
C33H48N8O5S
Mol. Mass.:
668.85
SMILES:
CN(C)CCCN1CCN(CC1)C(=O)C[C@@H](NS(=O)(=O)Cc1ccccc1)C(=O)N1CCC[C@H]1C(=O)NCc1ccc(cc1)C(N)=N
: