Target
Peroxisome proliferator-activated receptor alpha
Ligand
BDBM28699
Substrate
Meas. Tech.
ChEMBL_759360 (CHEMBL1809823)
EC50
55000±n/a nM
Citation
 Ammazzalorso, AGiancristofaro, AD'Angelo, AFilippis, BDFantacuzzi, MGiampietro, LMaccallini, CAmoroso, R Benzothiazole-based N-(phenylsulfonyl)amides as a novel family of PPARa antagonists. Bioorg Med Chem Lett 21:4869-72 (2011)  
Target
Name:
Peroxisome proliferator-activated receptor alpha
Synonyms:
NR1C1 PPAR PPAR-alpha PPARA_HUMAN Peroxisome proliferator-activated receptor | Peroxisome proliferator-activated receptor alpha (PPAR alpha)
Type:
Enzyme
Mol. Mass.:
52222.08
Organism:
Homo sapiens (Human)
Description:
Q07869
Residue:
468
  
Inhibitor
Name:
BDBM28699
Synonyms:
2-(4-chlorophenoxy)-2-methylpropanoic acid Clofibrate clofibric acid
Type:
Small organic molecule
Emp. Form.:
C10H11ClO3
Mol. Mass.:
214.646
SMILES:
CC(C)(Oc1ccc(Cl)cc1)C(O)=O
: