Target
Cytochrome P450 3A4
Ligand
BDBM25150
Substrate
Meas. Tech.
ChEMBL_759505 (CHEMBL1810946)
IC50
>10000±n/a nM
Citation
 Shultz, MFan, JChen, CCho, YSDavis, NBickford, SButeau, KCao, XHolmqvist, MHsu, MJiang, LLiu, GLu, QPatel, CSuresh, JRSelvaraj, MUrban, LWang, PYan-Neale, YWhitehead, LZhang, HZhou, LAtadja, P The design, synthesis and structure-activity relationships of novel isoindoline-based histone deacetylase inhibitors. Bioorg Med Chem Lett 21:4909-12 (2011)  
Target
Name:
Cytochrome P450 3A4
Synonyms:
Albendazole monooxygenase CP3A4_HUMAN CYP3A4 CYPIIIA4 Cytochrome P450 3A4 (CYP3A4) Nifedipine oxidase Taurochenodeoxycholate 6-alpha-hydroxylase
Type:
Enzyme
Mol. Mass.:
57349.57
Organism:
Homo sapiens (Human)
Description:
Residue:
503
  
Inhibitor
Name:
BDBM25150
Synonyms:
(2E)-N-hydroxy-3-[3-(phenylsulfamoyl)phenyl]prop-2-enamide Belinostat PXD101
Type:
Small organic molecule
Emp. Form.:
C15H14N2O4S
Mol. Mass.:
318.348
SMILES:
ONC(=O)\C=C\c1cccc(c1)S(=O)(=O)Nc1ccccc1
: