Target
C-X-C chemokine receptor type 3
Ligand
BDBM50349678
Substrate
Meas. Tech.
ChEMBL_760041 (CHEMBL1810317)
IC50
3300±n/a nM
Citation
 Thoma, GBaenteli, RLewis, IJones, DKovarik, JStreiff, MBZerwes, HG Special ergolines efficiently inhibit the chemokine receptor CXCR3 in blood. Bioorg Med Chem Lett 21:4745-9 (2011)  
Target
Name:
C-X-C chemokine receptor type 3
Synonyms:
CXCR3_RAT | Cxcr3
Type:
PROTEIN
Mol. Mass.:
40937.37
Organism:
Rattus norvegicus
Description:
ChEMBL_760041
Residue:
367
  
Inhibitor
Name:
BDBM50349678
Synonyms:
CHEMBL1806523
Type:
Small organic molecule
Emp. Form.:
C26H26N4O2
Mol. Mass.:
426.5102
SMILES:
O=C(Nc1ccccc1)N1C[C@@H](C=C2[C@H]1Cc1c[nH]c3cccc2c13)C(=O)N1CCCC1
: