Target
Ketohexokinase
Ligand
BDBM50349745
Substrate
Meas. Tech.
ChEMBL_759463 (CHEMBL1810789)
IC50
480±n/a nM
Citation
 Zhang, XSong, FKuo, GHXiang, AGibbs, ACAbad, MCSun, WKuo, LCSui, Z Optimization of a pyrazole hit from FBDD into a novel series of indazoles as ketohexokinase inhibitors. Bioorg Med Chem Lett 21:4762-7 (2011)  
Target
Name:
Ketohexokinase
Synonyms:
Hepatic fructokinase KHK_HUMAN Ketohexokinase (KHK) | Ketohexokinase (KHK) Isoform C
Type:
Enzyme Catalytic Domain
Mol. Mass.:
32521.64
Organism:
Homo sapiens (Human)
Description:
Residue:
298
  
Inhibitor
Name:
BDBM50349745
Synonyms:
CHEMBL1809172 US9771375, Example 124
Type:
Small organic molecule
Emp. Form.:
C19H18N4O2S
Mol. Mass.:
366.437
SMILES:
CSc1nn(-c2ccc(cc2)[N+]([O-])=O)c2cc(ccc12)C1=CCNCC1
: