Target
Ketohexokinase
Ligand
BDBM50349751
Substrate
Meas. Tech.
ChEMBL_759463 (CHEMBL1810789)
IC50
560±n/a nM
Citation
 Zhang, XSong, FKuo, GHXiang, AGibbs, ACAbad, MCSun, WKuo, LCSui, Z Optimization of a pyrazole hit from FBDD into a novel series of indazoles as ketohexokinase inhibitors. Bioorg Med Chem Lett 21:4762-7 (2011)  
Target
Name:
Ketohexokinase
Synonyms:
Hepatic fructokinase KHK_HUMAN Ketohexokinase (KHK) | Ketohexokinase (KHK) Isoform C
Type:
Enzyme Catalytic Domain
Mol. Mass.:
32521.64
Organism:
Homo sapiens (Human)
Description:
Residue:
298
  
Inhibitor
Name:
BDBM50349751
Synonyms:
CHEMBL1809178 US9771375, Example 46
Type:
Small organic molecule
Emp. Form.:
C24H31N5
Mol. Mass.:
389.5364
SMILES:
CCc1nn(-c2ccccc2)c2cc(ccc12)N1CCN(CC1)C1CCNCC1
: