Target
Peroxisome proliferator-activated receptor gamma
Ligand
BDBM50349808
Substrate
Meas. Tech.
ChEMBL_760322 (CHEMBL1815137)
EC50
0.0003±n/a nM
Citation
 Raval, PJain, MGoswami, ABasu, SGite, AGodha, APingali, HRaval, SGiri, SSuthar, DShah, MPatel, P Revisiting glitazars: thiophene substituted oxazole containinga-ethoxy phenylpropanoic acid derivatives as highly potent PPARa/¿ dual agonists devoid of adverse effects in rodents. Bioorg Med Chem Lett 21:3103-9 (2011)  
Target
Name:
Peroxisome proliferator-activated receptor gamma
Synonyms:
NR1C3 PPAR-gamma PPARG_HUMAN Peroxisome proliferator-activated receptor gamma (PPAR gamma) Peroxisome proliferator-activated receptor gamma (PPARĪ³) peroxisome proliferator-activated receptor gamma isoform 2
Type:
Nuclear Receptor
Mol. Mass.:
57613.46
Organism:
Homo sapiens (Human)
Description:
P37231
Residue:
505
  
Inhibitor
Name:
BDBM50349808
Synonyms:
CHEMBL1813005
Type:
Small organic molecule
Emp. Form.:
C21H23NO5S
Mol. Mass.:
401.476
SMILES:
CCO[C@@H](Cc1ccc(OCc2nc(oc2C)-c2sccc2C)cc1)C(O)=O
: