Target
Carbonic anhydrase 2
Ligand
BDBM50349859
Substrate
Meas. Tech.
ChEMBL_760547 (CHEMBL1815532)
Ki
376±n/a nM
Citation
 Carta, FGaraj, VMaresca, AWagner, JAvvaru, BSRobbins, AHScozzafava, AMcKenna, RSupuran, CT Sulfonamides incorporating 1,3,5-triazine moieties selectively and potently inhibit carbonic anhydrase transmembrane isoforms IX, XII and XIV over cytosolic isoforms I and II: Solution and X-ray crystallographic studies. Bioorg Med Chem 19:3105-19 (2011)  
Target
Name:
Carbonic anhydrase 2
Synonyms:
CA-II CAC Carbonate dehydratase II Carbonic anhydrase 2 (CA-II) Carbonic anhydrase C Carbonic anhydrase II (CA-II) Carbonic anhydrase II (hCA II) | Carbonic anhydrase isoenzyme II (hCA II)
Type:
Enzyme
Mol. Mass.:
29250.71
Organism:
Homo sapiens (Human)
Description:
P00918
Residue:
260
  
Inhibitor
Name:
BDBM50349859
Synonyms:
CHEMBL1813206
Type:
Small organic molecule
Emp. Form.:
C13H15N7O6S
Mol. Mass.:
397.367
SMILES:
NS(=O)(=O)c1ccc(Nc2nc(NCC(O)=O)nc(NCC(O)=O)n2)cc1
: