Target
Carbonic anhydrase 14
Ligand
BDBM50349859
Substrate
Meas. Tech.
ChEMBL_760550 (CHEMBL1815535)
Ki
7.2±n/a nM
Citation
 Carta, FGaraj, VMaresca, AWagner, JAvvaru, BSRobbins, AHScozzafava, AMcKenna, RSupuran, CT Sulfonamides incorporating 1,3,5-triazine moieties selectively and potently inhibit carbonic anhydrase transmembrane isoforms IX, XII and XIV over cytosolic isoforms I and II: Solution and X-ray crystallographic studies. Bioorg Med Chem 19:3105-19 (2011)  
Target
Name:
Carbonic anhydrase 14
Synonyms:
CA-XIV CAH14_HUMAN Carbonic Anhydrase XIV Carbonic anhydrase 14 Carbonic anhydrase XIV (CA XIV)
Type:
Enzyme
Mol. Mass.:
37665.67
Organism:
Homo sapiens (Human)
Description:
Human (cloned) isozyme.
Residue:
337
  
Inhibitor
Name:
BDBM50349859
Synonyms:
CHEMBL1813206
Type:
Small organic molecule
Emp. Form.:
C13H15N7O6S
Mol. Mass.:
397.367
SMILES:
NS(=O)(=O)c1ccc(Nc2nc(NCC(O)=O)nc(NCC(O)=O)n2)cc1
: