Target
Hepatocyte growth factor receptor
Ligand
BDBM50350073
Substrate
Meas. Tech.
ChEMBL_762122 (CHEMBL1816161)
IC50
191±n/a nM
Citation
 Zhao, AGao, XWang, YAi, JWang, YChen, YGeng, MZhang, A Discovery of novel c-Met kinase inhibitors bearing a thieno[2,3-d]pyrimidine or furo[2,3-d]pyrimidine scaffold. Bioorg Med Chem 19:3906-18 (2011)  
Target
Name:
Hepatocyte growth factor receptor
Synonyms:
Hepatocyte growth factor receptor Hepatocyte growth factor receptor (c-MET) MET Met proto-oncogene (hepatocyte growth factor receptor) Tyrosine-protein kinase Met (c-Met) c-Met kinase
Type:
Protein
Mol. Mass.:
155559.73
Organism:
Homo sapiens (Human)
Description:
P08581
Residue:
1390
  
Inhibitor
Name:
BDBM50350073
Synonyms:
CHEMBL1813638
Type:
Small organic molecule
Emp. Form.:
C31H17F5N4O3S
Mol. Mass.:
620.549
SMILES:
Fc1ccc(cc1)-n1cccc(C(=O)Nc2ccc(Oc3ncnc4scc(-c5ccc(cc5)C(F)(F)F)c34)c(F)c2)c1=O
: