Target
Hepatocyte growth factor receptor
Ligand
BDBM50350081
Substrate
Meas. Tech.
ChEMBL_762122 (CHEMBL1816161)
IC50
>10000±n/a nM
Citation
 Zhao, AGao, XWang, YAi, JWang, YChen, YGeng, MZhang, A Discovery of novel c-Met kinase inhibitors bearing a thieno[2,3-d]pyrimidine or furo[2,3-d]pyrimidine scaffold. Bioorg Med Chem 19:3906-18 (2011)  
Target
Name:
Hepatocyte growth factor receptor
Synonyms:
Hepatocyte growth factor receptor Hepatocyte growth factor receptor (c-MET) MET Met proto-oncogene (hepatocyte growth factor receptor) Tyrosine-protein kinase Met (c-Met) c-Met kinase
Type:
Protein
Mol. Mass.:
155559.73
Organism:
Homo sapiens (Human)
Description:
P08581
Residue:
1390
  
Inhibitor
Name:
BDBM50350081
Synonyms:
CHEMBL1813647
Type:
Small organic molecule
Emp. Form.:
C28H16F2N4O4S
Mol. Mass.:
542.513
SMILES:
Fc1ccc(cc1)-n1cccc(C(=O)Nc2ccc(Oc3ncnc4occ(-c5cccs5)c34)c(F)c2)c1=O
: