Target
Hepatocyte growth factor receptor
Ligand
BDBM50350087
Substrate
Meas. Tech.
ChEMBL_762122 (CHEMBL1816161)
IC50
>10000±n/a nM
Citation
 Zhao, AGao, XWang, YAi, JWang, YChen, YGeng, MZhang, A Discovery of novel c-Met kinase inhibitors bearing a thieno[2,3-d]pyrimidine or furo[2,3-d]pyrimidine scaffold. Bioorg Med Chem 19:3906-18 (2011)  
Target
Name:
Hepatocyte growth factor receptor
Synonyms:
Hepatocyte growth factor receptor Hepatocyte growth factor receptor (c-MET) MET Met proto-oncogene (hepatocyte growth factor receptor) Tyrosine-protein kinase Met (c-Met) c-Met kinase
Type:
Protein
Mol. Mass.:
155559.73
Organism:
Homo sapiens (Human)
Description:
P08581
Residue:
1390
  
Inhibitor
Name:
BDBM50350087
Synonyms:
CHEMBL1813648
Type:
Small organic molecule
Emp. Form.:
C29H18F2N4O4S
Mol. Mass.:
556.539
SMILES:
Cc1nc(Oc2ccc(NC(=O)c3cccn(-c4ccc(F)cc4)c3=O)cc2F)c2c(coc2n1)-c1cccs1
: