Target
Gamma-aminobutyric acid receptor subunit alpha-1/beta-2
Ligand
BDBM50419030
Substrate
Meas. Tech.
ChEMBL_761260 (CHEMBL1816618)
EC50
7700±n/a nM
Citation
 Taferner, BSchuehly, WHuefner, ABaburin, IWiesner, KEcker, GFHering, S Modulation of GABAA-receptors by honokiol and derivatives: subtype selectivity and structure-activity relationship. J Med Chem 54:5349-61 (2011)  
Target
Name:
Gamma-aminobutyric acid receptor subunit alpha-1/beta-2
Synonyms:
GABA-A receptor; GABA-A site (alpha1/beta2 interface)
Type:
Mol. Mass.:
Description:
ASSAY_ID of EBI is 761260
Components:
This complex has 2 components.
Component 1
Name:
Gamma-aminobutyric acid receptor subunit beta-2
Synonyms:
GABA(A) receptor subunit beta-2 GBRB2_HUMAN
Type:
PROTEIN
Mol. Mass.:
59167.91
Organism:
Homo sapiens (Human)
Description:
EBI_221
Residue:
512
  
Component 2
Name:
Gamma-aminobutyric acid receptor subunit alpha-1
Synonyms:
Benzodiazepine central GABA A Benzodiazepine liver GABA(A) receptor subunit alpha-1 GABA-A receptor GBRA1_HUMAN TBPS | agonist GABA site
Type:
Protein
Mol. Mass.:
51817.35
Organism:
Homo sapiens (Human)
Description:
P14867
Residue:
456
  
Inhibitor
Name:
BDBM50419030
Synonyms:
CHEMBL1814310
Type:
Small organic molecule
Emp. Form.:
C21H25NO2
Mol. Mass.:
323.4287
SMILES:
CCNc1cc(CC=C)cc(c1O)-c1ccc(OC)c(CC=C)c1
: