Target
Liver carboxylesterase 1
Ligand
BDBM50350321
Substrate
Meas. Tech.
ChEMBL_762141 (CHEMBL1816212)
Ki
3±n/a nM
Citation
 Parkinson, EIJason Hatfield, MTsurkan, LHyatt, JLEdwards, CCHicks, LDYan, BPotter, PM Requirements for mammalian carboxylesterase inhibition by substituted ethane-1,2-diones. Bioorg Med Chem 19:4635-43 (2011)  
Target
Name:
Liver carboxylesterase 1
Synonyms:
Acyl coenzyme A:cholesterol acyltransferase CES1 EST1_HUMAN Serine hydrolase (CES1)
Type:
Protein
Mol. Mass.:
62520.83
Organism:
Homo sapiens (Human)
Description:
Residue:
567
  
Inhibitor
Name:
BDBM50350321
Synonyms:
CHEMBL1812856
Type:
Small organic molecule
Emp. Form.:
C12H22O2
Mol. Mass.:
198.3019
SMILES:
CCCCCC(=O)C(=O)CCCCC
: