Target
Cocaine esterase
Ligand
BDBM50350325
Substrate
Meas. Tech.
ChEMBL_762142 (CHEMBL1816213)
Ki
45.5±n/a nM
Citation
 Parkinson, EIJason Hatfield, MTsurkan, LHyatt, JLEdwards, CCHicks, LDYan, BPotter, PM Requirements for mammalian carboxylesterase inhibition by substituted ethane-1,2-diones. Bioorg Med Chem 19:4635-43 (2011)  
Target
Name:
Cocaine esterase
Synonyms:
CES2 EST2_HUMAN | ICE
Type:
PROTEIN
Mol. Mass.:
61801.08
Organism:
Homo sapiens (Human)
Description:
ChEMBL_1494240
Residue:
559
  
Inhibitor
Name:
BDBM50350325
Synonyms:
CHEMBL1812863
Type:
Small organic molecule
Emp. Form.:
C13H16O2
Mol. Mass.:
204.2649
SMILES:
CCCCCC(=O)C(=O)c1ccccc1
: