Target
Polyunsaturated fatty acid lipoxygenase ALOX12
Ligand
BDBM50350396
Substrate
Meas. Tech.
ChEMBL_762451 (CHEMBL1816721)
IC50
13000±n/a nM
Citation
 Kenyon, VRai, GJadhav, ASchultz, LArmstrong, MJameson, JBPerry, SJoshi, NBougie, JMLeister, WTaylor-Fishwick, DANadler, JLHolinstat, MSimeonov, AMaloney, DJHolman, TR Discovery of potent and selective inhibitors of human platelet-type 12- lipoxygenase. J Med Chem 54:5485-97 (2011)  
Target
Name:
Polyunsaturated fatty acid lipoxygenase ALOX12
Synonyms:
12-LOX 12LO Arachidonate 12-lipoxygenase LOG12 Platelet 12-lipoxygenase | Platelet-type lipoxygenase 12
Type:
Protein
Mol. Mass.:
75689.18
Organism:
Homo sapiens (Human)
Description:
P18054
Residue:
663
  
Inhibitor
Name:
BDBM50350396
Synonyms:
CHEMBL1573436
Type:
Small organic molecule
Emp. Form.:
C16H13BrN2O2S
Mol. Mass.:
377.256
SMILES:
CC(=O)NC(c1cccs1)c1cc(Br)c2cccnc2c1O
: