Target
Fatty-acid amide hydrolase 1
Ligand
BDBM50161520
Substrate
Meas. Tech.
ChEMBL_762794 (CHEMBL1816096)
Ki
0.39±n/a nM
Citation
 Otrubova, KEzzili, CBoger, DL The discovery and development of inhibitors of fatty acid amide hydrolase (FAAH). Bioorg Med Chem Lett 21:4674-85 (2011)  
Target
Name:
Fatty-acid amide hydrolase 1
Synonyms:
Anandamide amidohydrolase FAAH FAAH1_HUMAN Fatty-acid amide hydrolase (FAAH) Oleamide hydrolase 1
Type:
Protein
Mol. Mass.:
63071.19
Organism:
Homo sapiens (Human)
Description:
O00519
Residue:
579
  
Inhibitor
Name:
BDBM50161520
Synonyms:
1-(oxazolo[4,5-b]pyridin-2-yl)-8-phenyloctan-1-one CHEMBL179760
Type:
Small organic molecule
Emp. Form.:
C20H22N2O2
Mol. Mass.:
322.4009
SMILES:
O=C(CCCCCCCc1ccccc1)c1nc2ncccc2o1
: