Target
Angiotensin-converting enzyme
Ligand
BDBM50313764
Substrate
Meas. Tech.
ChEMBL_762422 (CHEMBL1816595)
IC50
260000±n/a nM
Citation
 Kantevari, SAddla, DBagul, PKSridhar, BBanerjee, SK Synthesis and evaluation of novel 2-butyl-4-chloro-1-methylimidazole embedded chalcones and pyrazoles as angiotensin converting enzyme (ACE) inhibitors. Bioorg Med Chem 19:4772-81 (2011)  
Target
Name:
Angiotensin-converting enzyme
Synonyms:
3.2.1.- ACE Angiotensin-converting enzyme, soluble form DCP1 Kininase II
Type:
Mol. Mass.:
150405.15
Organism:
Oryctolagus cuniculus
Description:
Residue:
1310
  
Inhibitor
Name:
BDBM50313764
Synonyms:
5,7-dihydroxy-2-(4-hydroxyphenyl)-3-((2S,3R,4S,5R,6R)-3,4,5-trihydroxy-6-(hydroxymethyl)tetrahydro-2H-pyran-2-yloxy)-4H-chromen-4-one Kaempferol-3-O-beta-D-galactoside kaempferol-3-O-beta-galactopyranoside
Type:
Small organic molecule
Emp. Form.:
C21H20O11
Mol. Mass.:
448.3769
SMILES:
OC[C@H]1O[C@@H](Oc2c(O)c3c(cc(O)cc3=O)oc2-c2ccc(O)cc2)[C@H](O)[C@@H](O)[C@H]1O
: