Target
Prothrombin
Ligand
BDBM50350701
Substrate
Meas. Tech.
ChEMBL_762730 (CHEMBL1815981)
Kd
37±n/a nM
Citation
 Jensen, TBHenriksen, JRRasmussen, BERasmussen, LMAndresen, TLWengel, JPasternak, A Thermodynamic and biological evaluation of a thrombin binding aptamer modified with several unlocked nucleic acid (UNA) monomers and a 2'-C-piperazino-UNA monomer. Bioorg Med Chem 19:4739-45 (2011)  
Target
Name:
Prothrombin
Synonyms:
Activation peptide fragment 1 Coagulation factor II Prothrombin precursor Thrombin heavy chain | Thrombin light chain
Type:
Protein
Mol. Mass.:
70029.57
Organism:
Homo sapiens (Human)
Description:
P00734
Residue:
622
  
Inhibitor
Name:
BDBM50350701
Synonyms:
CHEMBL1814826
Type:
Small organic molecule
Emp. Form.:
C149H201N71O81P14
Mol. Mass.:
4716.25
SMILES:
Cc1cn([C@H]2C[C@H](OP(N)(=O)OC[C@@H]3C[C@@H](OP(N)(=O)OC[C@H]4O[C@H](C[C@@H]4OP(N)(=O)OC[C@H](COP(N)(=O)OC[C@H]4O[C@H](C[C@@H]4OP(N)(=O)OC[C@H]4O[C@H](C[C@@H]4OP(N)(=O)OC[C@H]4O[C@H](C[C@@H]4OP(N)(=O)OC[C@H]4O[C@H](C[C@@H]4OP(N)(=O)OC[C@H]4O[C@H](C[C@@H]4OP(N)(=O)OC[C@H]4O[C@H](C[C@@H]4OP(N)(=O)OC[C@H]4O[C@H](C[C@@H]4OP(N)(=O)OC[C@H]4O[C@H](C[C@@H]4O)n4cnc5c4nc(N)[nH]c5=O)n4cnc5c4nc(N)[nH]c5=O)n4cc(C)c(=O)[nH]c4=O)n4cc(C)c(=O)[nH]c4=O)n4cnc5c4nc(N)[nH]c5=O)n4cnc5c4nc(N)[nH]c5=O)n4cc(C)c(=O)[nH]c4=O)n4cnc5c4nc(N)[nH]c5=O)O[C@H](CO)n4ccc(=O)[nH]c4=O)n4cnc5c4nc(N)[nH]c5=O)[C@@H](O3)n3cnc4c3nc(N)[nH]c4=O)[C@@H](COP(N)(=O)O[C@H]3C[C@@H](O[C@@H]3COP(N)(=O)O[C@H]3C[C@@H](O[C@@H]3COP(N)(=O)O[C@H]3C[C@@H](O[C@@H]3CO)n3cnc4c3nc(N)[nH]c4=O)n3cnc4c3nc(N)[nH]c4=O)n3cc(C)c(=O)[nH]c3=O)O2)c(=O)[nH]c1=O
: