Target
Lysosomal acid glucosylceramidase
Ligand
BDBM50292389
Substrate
Meas. Tech.
ChEMBL_763062 (CHEMBL1820879)
IC50
5600±n/a nM
Citation
 Kato, AMiyauchi, SKato, NNash, RJYoshimura, YNakagome, IHirono, STakahata, HAdachi, I Docking and SAR studies of D- and L-isofagomine isomers as humanß-glucocerebrosidase inhibitors. Bioorg Med Chem 19:3558-68 (2011)  
Target
Name:
Lysosomal acid glucosylceramidase
Synonyms:
Acid beta-glucosidase GBA GBA1_BOVIN | Glucosylceramidase
Type:
PROTEIN
Mol. Mass.:
59862.93
Organism:
Bos taurus
Description:
ChEMBL_1460504
Residue:
536
  
Inhibitor
Name:
BDBM50292389
Synonyms:
3-epi-fagomine CHEMBL456583
Type:
Small organic molecule
Emp. Form.:
C6H13NO3
Mol. Mass.:
147.1723
SMILES:
OC[C@H]1NCC[C@H](O)[C@@H]1O
: