Target
Lactase/phlorizin hydrolase
Ligand
BDBM50182801
Substrate
Meas. Tech.
ChEMBL_763052 (CHEMBL1820869)
IC50
120±n/a nM
Citation
 Kato, AMiyauchi, SKato, NNash, RJYoshimura, YNakagome, IHirono, STakahata, HAdachi, I Docking and SAR studies of D- and L-isofagomine isomers as humanß-glucocerebrosidase inhibitors. Bioorg Med Chem 19:3558-68 (2011)  
Target
Name:
Lactase/phlorizin hydrolase
Synonyms:
LPH_RAT Lct | Lph
Type:
PROTEIN
Mol. Mass.:
217253.31
Organism:
Rattus norvegicus
Description:
ChEMBL_96426
Residue:
1928
  
Inhibitor
Name:
BDBM50182801
Synonyms:
(3R,4R,5R)-5-(Hydroxymethyl)piperidine-3,4-diol, 8 5-HYDROXYMETHYL-3,4-DIHYDROXYPIPERIDINE CHEMBL206468 US10081601, Example 1.1 isofagomine
Type:
Small organic molecule
Emp. Form.:
C6H13NO3
Mol. Mass.:
147.1723
SMILES:
OC[C@H]1CNC[C@@H](O)[C@@H]1O
: