Target
Lysosomal acid glucosylceramidase
Ligand
BDBM50263043
Substrate
Meas. Tech.
ChEMBL_763063 (CHEMBL1820880)
IC50
8700±n/a nM
Citation
 Kato, AMiyauchi, SKato, NNash, RJYoshimura, YNakagome, IHirono, STakahata, HAdachi, I Docking and SAR studies of D- and L-isofagomine isomers as humanß-glucocerebrosidase inhibitors. Bioorg Med Chem 19:3558-68 (2011)  
Target
Name:
Lysosomal acid glucosylceramidase
Synonyms:
Acid beta-glucosidase Beta-glucocerebrosidase D-glucosyl-N-acylsphingosine glucohydrolase GBA1 GC GLUC Glucosylceramidase (GBA) Glucosylceramidase precursor (Beta-glucocerebrosidase) (Acid beta-glucosidase) (D-glucosyl-N-acylsphingosine glucohydrolase) (Alglucerase) (Imiglucerase) beta-glucocerebrosidase (GCase)
Type:
Enzyme
Mol. Mass.:
59724.64
Organism:
Homo sapiens (Human)
Description:
The beta-Glu activity was measured with commercially available beta-glucocerebrosidase (Ceredase) as the enzyme source.
Residue:
536
  
Inhibitor
Name:
BDBM50263043
Synonyms:
CHEMBL501385 | L-Isofagomine
Type:
Small organic molecule
Emp. Form.:
C6H13NO3
Mol. Mass.:
147.1723
SMILES:
OC[C@@H]1CNC[C@H](O)[C@H]1O
: