Target
Sucrase-isomaltase, intestinal
Ligand
BDBM50163447
Substrate
Meas. Tech.
ChEMBL_763059 (CHEMBL1820876)
IC50
18000±n/a nM
Citation
 Kato, AMiyauchi, SKato, NNash, RJYoshimura, YNakagome, IHirono, STakahata, HAdachi, I Docking and SAR studies of D- and L-isofagomine isomers as humanß-glucocerebrosidase inhibitors. Bioorg Med Chem 19:3558-68 (2011)  
Target
Name:
Sucrase-isomaltase, intestinal
Synonyms:
SUIS_RAT Sucrase-isomaltase | alpha-Glucosidase (α-Glucosidase)
Type:
Enzyme
Mol. Mass.:
210329.04
Organism:
Rattus norvegicus (Rat)
Description:
P23739
Residue:
1841
  
Inhibitor
Name:
BDBM50163447
Synonyms:
(2S,3S,4S,5R)-2-Hydroxymethyl-piperidine-3,4,5-triol | CHEMBL369297
Type:
Small organic molecule
Emp. Form.:
C6H13NO4
Mol. Mass.:
163.1717
SMILES:
OC[C@@H]1NC[C@@H](O)[C@H](O)[C@H]1O
: