Target
Bifunctional dihydrofolate reductase-thymidylate synthase
Ligand
BDBM50350770
Substrate
Meas. Tech.
ChEMBL_763106 (CHEMBL1819661)
IC50
140±n/a nM
Citation
 Zhang, XZhou, XKisliuk, RLPiraino, JCody, VGangjee, A Design, synthesis, biological evaluation and X-ray crystal structure of novel classical 6,5,6-tricyclic benzo[4,5]thieno[2,3-d]pyrimidines as dual thymidylate synthase and dihydrofolate reductase inhibitors. Bioorg Med Chem 19:3585-94 (2011)  
Target
Name:
Bifunctional dihydrofolate reductase-thymidylate synthase
Synonyms:
DHFR-TS Dihydrofolate reductase Dihydrofolate reductase; T. gondii vs rat
Type:
Enzyme
Mol. Mass.:
68757.49
Organism:
Toxoplasma gondii
Description:
Q07422
Residue:
610
  
Inhibitor
Name:
BDBM50350770
Synonyms:
CHEMBL1738741
Type:
Small organic molecule
Emp. Form.:
C23H21N5O6S
Mol. Mass.:
495.508
SMILES:
Nc1nc2sc3cccc(CNc4ccc(cc4)C(=O)N[C@@H](CCC(O)=O)C(O)=O)c3c2c(=O)[nH]1
: