Target
Dihydrofolate reductase
Ligand
BDBM50351188
Substrate
Meas. Tech.
ChEMBL_764179 (CHEMBL1821390)
Ki
2.7±n/a nM
Citation
 Li, XHilgers, MCunningham, MChen, ZTrzoss, MZhang, JKohnen, LLam, TCreighton, CG C, KNelson, KKwan, BStidham, MBrown-Driver, VShaw, KJFinn, J Structure-based design of new DHFR-based antibacterial agents: 7-aryl-2,4-diaminoquinazolines. Bioorg Med Chem Lett 21:5171-6 (2011)  
Target
Name:
Dihydrofolate reductase
Synonyms:
DYR_STAAU Dihydrofolate reductase Tetrahydrofolate dehydrogenase | folA
Type:
Enzyme
Mol. Mass.:
18249.71
Organism:
Staphylococcus aureus
Description:
Residue:
159
  
Inhibitor
Name:
BDBM50351188
Synonyms:
CHEMBL1818113 | US8835445, 1
Type:
Small organic molecule
Emp. Form.:
C15H14N4O
Mol. Mass.:
266.2979
SMILES:
COc1ccccc1-c1ccc2c(N)nc(N)nc2c1
: