Target
Cytochrome P450 3A4
Ligand
BDBM50351402
Substrate
Meas. Tech.
ChEMBL_764492 (CHEMBL1821044)
IC50
>50000±n/a nM
Citation
 Nishio, YKimura, HSawada, NSugaru, EHoriguchi, MOno, MFuruta, YSakai, MMasui, YOtani, MHashizuka, THonda, YDeguchi, JNakagawa, TNakahira, H 2-({6-[(3R)-3-amino-3-methylpiperidine-1-yl]-1,3-dimethyl-2,4-dioxo-1,2,3,4-tetrahydro-5H-pyrrolo[3,2-d]pyrimidine-5-yl}methyl)-4-fluorobenzonitrile (DSR-12727): a potent, orally active dipeptidyl peptidase IV inhibitor without mechanism-based inactivation of CYP3A. Bioorg Med Chem 19:5490-9 (2011)  
Target
Name:
Cytochrome P450 3A4
Synonyms:
Albendazole monooxygenase CP3A4_HUMAN CYP3A4 CYPIIIA4 Cytochrome P450 3A4 (CYP3A4) Nifedipine oxidase Taurochenodeoxycholate 6-alpha-hydroxylase
Type:
Enzyme
Mol. Mass.:
57349.57
Organism:
Homo sapiens (Human)
Description:
Residue:
503
  
Inhibitor
Name:
BDBM50351402
Synonyms:
CHEMBL1819090
Type:
Small organic molecule
Emp. Form.:
C22H25FN6O2
Mol. Mass.:
424.4713
SMILES:
Cn1c2cc(N3CCC[C@@](C)(N)C3)n(Cc3cc(F)ccc3C#N)c2c(=O)n(C)c1=O
: