Target
Cytochrome P450 2D6
Ligand
BDBM50351402
Substrate
Meas. Tech.
ChEMBL_764509 (CHEMBL1821061)
IC50
38000±n/a nM
Citation
 Nishio, YKimura, HSawada, NSugaru, EHoriguchi, MOno, MFuruta, YSakai, MMasui, YOtani, MHashizuka, THonda, YDeguchi, JNakagawa, TNakahira, H 2-({6-[(3R)-3-amino-3-methylpiperidine-1-yl]-1,3-dimethyl-2,4-dioxo-1,2,3,4-tetrahydro-5H-pyrrolo[3,2-d]pyrimidine-5-yl}methyl)-4-fluorobenzonitrile (DSR-12727): a potent, orally active dipeptidyl peptidase IV inhibitor without mechanism-based inactivation of CYP3A. Bioorg Med Chem 19:5490-9 (2011)  
Target
Name:
Cytochrome P450 2D6
Synonyms:
CP2D6_HUMAN CYP2DL1 Cytochrome P450 2D6 (CYP2D6) P450-DB1
Type:
Protein
Mol. Mass.:
55774.82
Organism:
Homo sapiens (Human)
Description:
P10635
Residue:
497
  
Inhibitor
Name:
BDBM50351402
Synonyms:
CHEMBL1819090
Type:
Small organic molecule
Emp. Form.:
C22H25FN6O2
Mol. Mass.:
424.4713
SMILES:
Cn1c2cc(N3CCC[C@@](C)(N)C3)n(Cc3cc(F)ccc3C#N)c2c(=O)n(C)c1=O
: