Target
Sodium/glucose cotransporter 1
Ligand
BDBM50351431
Substrate
Meas. Tech.
ChEMBL_764618 (CHEMBL1821170)
IC50
6700±n/a nM
Citation
 Ohtake, YSato, TMatsuoka, HNishimoto, MTaka, NTakano, KYamamoto, KOhmori, MHiguchi, TMurakata, MKobayashi, TMorikawa, KShimma, NSuzuki, MHagita, HOzawa, KYamaguchi, KKato, MIkeda, S 5a-Carba-ß-D-glucopyranose derivatives as novel sodium-dependent glucose cotransporter 2 (SGLT2) inhibitors for the treatment of type 2 diabetes. Bioorg Med Chem 19:5334-41 (2011)  
Target
Name:
Sodium/glucose cotransporter 1
Synonyms:
High affinity sodium-glucose cotransporter Na(+)/glucose cotransporter 1 SGLT1 Sodium-dependent glucose cotransporter 1 (SGLT1) Sodium/glucose cotransporter 1 (SGLT1) | Solute carrier family 5 member 1
Type:
Protein
Mol. Mass.:
73503.78
Organism:
Homo sapiens (Human)
Description:
P13866
Residue:
664
  
Inhibitor
Name:
BDBM50351431
Synonyms:
CHEMBL1819485
Type:
Small organic molecule
Emp. Form.:
C21H26O5
Mol. Mass.:
358.4281
SMILES:
Cc1ccc(Cc2ccccc2O[C@@H]2C[C@H](CO)[C@@H](O)[C@H](O)[C@H]2O)cc1
: