Target
Voltage-dependent T-type calcium channel subunit alpha-1G
Ligand
BDBM50351464
Substrate
Meas. Tech.
ChEMBL_764625 (CHEMBL1821177)
IC50
120±n/a nM
Citation
 Watanuki, SMatsuura, KTomura, YOkada, MOkazaki, TOhta, MTsukamoto, S Synthesis and pharmacological evaluation of 1-alkyl-N-[2-ethyl-2-(4-fluorophenyl)butyl]piperidine-4-carboxamide derivatives as novel antihypertensive agents. Bioorg Med Chem 19:5628-38 (2011)  
Target
Name:
Voltage-dependent T-type calcium channel subunit alpha-1G
Synonyms:
CAC1G_HUMAN KIAA1123 Voltage-gated T-type calcium channel alpha-1G subunit
Type:
PROTEIN
Mol. Mass.:
262471.14
Organism:
Homo sapiens (Human)
Description:
ChEMBL_1515216
Residue:
2377
  
Inhibitor
Name:
BDBM50351464
Synonyms:
CHEMBL1819518
Type:
Small organic molecule
Emp. Form.:
C26H35FN2O2
Mol. Mass.:
426.5667
SMILES:
CCC(CC)(CNC(=O)C1CCN(Cc2ccccc2OC)CC1)c1ccc(F)cc1
: