Target
Prostaglandin F2-alpha receptor
Ligand
BDBM50351480
Substrate
Meas. Tech.
ChEMBL_764677 (CHEMBL1821229)
Ki
>10000±n/a nM
Citation
 Iwahashi, MTakahashi, ETanaka, MMatsunaga, YOkada, YMatsumoto, RNambu, FNakai, HToda, M Design and synthesis of new prostaglandin D2 receptor antagonists. Bioorg Med Chem 19:5361-71 (2011)  
Target
Name:
Prostaglandin F2-alpha receptor
Synonyms:
PF2R_MOUSE Ptgfr
Type:
Enzyme Catalytic Domain
Mol. Mass.:
40714.02
Organism:
MOUSE
Description:
ProstaglandinF2Alpha PTGFR MOUSE::P43117
Residue:
366
  
Inhibitor
Name:
BDBM50351480
Synonyms:
CHEMBL1819608
Type:
Small organic molecule
Emp. Form.:
C26H26N2O5
Mol. Mass.:
446.495
SMILES:
CN1C[C@@H](COc2ccc(C(=O)Nc3cccc(CC(O)=O)c3)c(C)c2)Oc2ccccc12
: