Target
Hepatocyte growth factor receptor
Ligand
BDBM50351665
Substrate
Meas. Tech.
ChEMBL_764847 (CHEMBL1826790)
IC50
0.5±n/a nM
Citation
 Xie, QQZhong, LPan, YLWang, XYZhou, JPDi-Wu, LHuang, QWang, YLYang, LLXie, HZYang, SY Combined SVM-based and docking-based virtual screening for retrieving novel inhibitors of c-Met. Eur J Med Chem 46:3675-80 (2011)  
Target
Name:
Hepatocyte growth factor receptor
Synonyms:
Hepatocyte growth factor receptor Hepatocyte growth factor receptor (c-MET) MET Met proto-oncogene (hepatocyte growth factor receptor) Tyrosine-protein kinase Met (c-Met) c-Met kinase
Type:
Protein
Mol. Mass.:
155559.73
Organism:
Homo sapiens (Human)
Description:
P08581
Residue:
1390
  
Inhibitor
Name:
BDBM50351665
Synonyms:
CHEMBL1822369
Type:
Small organic molecule
Emp. Form.:
C27H30BrN5O5
Mol. Mass.:
584.462
SMILES:
OC[C@H]1CCCN1CCCNC(=O)c1cc2NC(=O)C(=NNC(=O)Cc3ccc4OCCc4c3)c2c(Br)c1
: