Target
Apoptosis regulator Bcl-2
Ligand
BDBM50336576
Substrate
Meas. Tech.
ChEMBL_765261 (CHEMBL1827900)
Ki
310±n/a nM
Citation
 Zhang, ZYang, HWu, GLi, ZSong, TLi, XQ Probing the difference between BH3 groove of Mcl-1 and Bcl-2 protein: Implications for dual inhibitors design. Eur J Med Chem 46:3909-16 (2011)  
Target
Name:
Apoptosis regulator Bcl-2
Synonyms:
Apoptosis regulator Bcl-2 Protein BCL-2 BCL2_HUMAN | Bcl-2 Protein
Type:
Homodimer or heterodimer
Mol. Mass.:
26269.11
Organism:
Homo sapiens (Human)
Description:
P10415
Residue:
239
  
Inhibitor
Name:
BDBM50336576
Synonyms:
3-Thiomorpholin-8-oxo-8H-acenaphtho[1,2-b]pyrrole-9-carbonitrile CHEMBL595134
Type:
Small organic molecule
Emp. Form.:
C19H13N3OS
Mol. Mass.:
331.391
SMILES:
O=c1nc2c3cccc4c(ccc(c2c1C#N)c34)N1CCSCC1
: