Target
cAMP and cAMP-inhibited cGMP 3',5'-cyclic phosphodiesterase 10A
Ligand
BDBM14754
Substrate
Meas. Tech.
ChEMBL_765735 (CHEMBL1827314)
IC50
36±n/a nM
Citation
 Zhang, ZLu, XXu, JRothfuss, JMach, RHTu, Z Synthesis and in vitro evaluation of new analogues as inhibitors for phosphodiesterase 10A. Eur J Med Chem 46:3986-95 (2011)  
Target
Name:
cAMP and cAMP-inhibited cGMP 3',5'-cyclic phosphodiesterase 10A
Synonyms:
PDE10_RAT Phosphodiesterase 10 Phosphodiesterase Type 10 (PDE10A) | Rat recombinant PDE10a (rPDE10a)
Type:
Enzyme
Mol. Mass.:
90160.88
Organism:
Rattus norvegicus (rat)
Description:
PDE10A was generated from the full-length recombinant rat clone transfected into Sf9 cells.
Residue:
794
  
Inhibitor
Name:
BDBM14754
Synonyms:
1-[(3,4-dimethoxyphenyl)methyl]-6,7-dimethoxy-isoquinoline 6,7-dimethoxy-1-veratryl-isoquinoline;hydrochloride Papaverine
Type:
Small organic molecule
Emp. Form.:
C20H21NO4
Mol. Mass.:
339.385
SMILES:
COc1ccc(Cc2nccc3cc(OC)c(OC)cc23)cc1OC
: