Target
Sigma non-opioid intracellular receptor 1
Ligand
BDBM50351988
Substrate
Meas. Tech.
ChEMBL_766140 (CHEMBL1826107)
Ki
2570±n/a nM
Citation
 Abate, CHornick, JRSpitzer, DHawkins, WGNiso, MPerrone, RBerardi, F Fluorescent derivatives ofs receptor ligand 1-cyclohexyl-4-[3-(5-methoxy-1,2,3,4-tetrahydronaphthalen-1-yl)propyl]piperazine (PB28) as a tool for uptake and cellular localization studies in pancreatic tumor cells. J Med Chem 54:5858-67 (2011)  
Target
Name:
Sigma non-opioid intracellular receptor 1
Synonyms:
OPRS1 SIGMAR1 Sigma non-opioid intracellular receptor 1 Sigma1-receptor Sterol isomerase-like protein
Type:
Protein
Mol. Mass.:
25307.17
Organism:
Cavia porcellus (Guinea pig)
Description:
Q60492
Residue:
223
  
Inhibitor
Name:
BDBM50351988
Synonyms:
CHEMBL1822595
Type:
Small organic molecule
Emp. Form.:
C35H51N7O4
Mol. Mass.:
633.8239
SMILES:
COc1cccc2C(CCCN3CCN(CC3)C3CCN(CCCCCCNc4ccc([N+]([O-])=O)c5[n-][o+]nc45)CC3)CCCc12
: